Org Bouncycastle Asn1 Asn1octetstring Error

Posted by Ariel on December 18, 2017 in KB |

RECOMMENDED: If you have Windows errors then we strongly recommend that you download and run this (Windows) Repair Tool.

Ole Automation Object Error 213 Jul 5, 2017. The OLE Automation system stored procedures return an int return code that is the HRESULT returned by the underlying OLE Automation operation. An HRESULT of 0 indicates success. A nonzero HRESULT is an OLE error code of the hexadecimal form 0x800nnnnn, but when returned as an int value in a. AR and

Let’s learn how to create PDF files in java using iText library. I am listing many small and simple examples to put the stress on basic functionalities.

addExtension(ASN1ObjectIdentifier, boolean, byte[]) – Method in class org. bouncycastle.asn1.x509.X509ExtensionsGenerator: Deprecated. Add an extension with the given oid and the passed in byte array to be wrapped in the OCTET STRING associated with the extension. addExtension(String, boolean, ASN1Encodable).

Hello everyone, i'm trying to bind the bouncy castle library (bcprov-jdk16-146.jar) into my Project. I'm trying to do these with maven, but when i call the function UaClient.connect() i am getting the Stack Trace: java.lang.SecurityException: class “org.bouncycastle.asn1.DEREncodable”'s signer information.

java.lang.NoClassDefFoundError: org/bouncycastle/asn1/ASN1Encodable at. I tried different versions of bouncycastle jars but I get the same error with difference.

I am getting java.lang.NoClassDefFoundError: org/bouncycastle/asn1/ASN1Primitive error. That error might be caused by a mixture of different versions. – mkl Nov. – ASN1OctetString; import org.bouncycastle.asn1. @param config servlet configuration * * @throws ServletException on error during initialization */ public void init(ServletConfig config) throws ServletException { super.init(config); try { // Install BouncyCastle provider log.debug("Re-installing BC-provider"); CertTools.

Python Raise Socket Error I want to connect to my bulb using python with this code, but there is problem : import socket msg = 'M-SEARCH * HTTP/1.1rn' 'ST:wifi_bulbrn' 'MAN:"ssdp: discover"rn' # Set up UDP socket s = so…. The problem is your code didn't get any response within 10 seconds and raise an exception. Are you. If the

java.lang.NoClassDefFoundError: org/bouncycastle/asn1/ASN1OctetString. hi, I encountered the following error in reading the pdf: Exception in thread "main" java.lang.


Oct 19, 2016. When I run cfpdf tag with action="protect" I get an error "org.bouncycastle.asn1. DEREncodable not found by bcprov [74]". Here is an example: <cfpdf action=" protect" encrypt="AES_128" source="/PDFPath" newUserPassword=" PDFPassword">. *Attached is the error screenshot. This code use to work in.

Mar 30, 2016. java.lang.RuntimeException: java. lang.ClassCastException: org.bouncycastle.asn1.DERInteger cannot be cast to org.bouncycastle.asn1.ASN1Sequence at trustedapps.ListApplicationRetriever.

Return an ASN1 sequence from a tagged object. There is a special case here, if an object appears to have been explicitly tagged on reading but we were expecting it to be implicitly tagged in the normal course of events it indicates that we lost the surrounding sequence – so we need to add it back (this will happen if the.

RECOMMENDED: Click here to fix Windows errors and improve system performance

Copyright © 2017-2018 All rights reserved.
This site is using the Multi Child-Theme, v2.2, on top of
the Parent-Theme Desk Mess Mirrored, v2.5, from