Error 6398 Timer

Posted by Ariel on September 23, 2017 in KB with Comments closed |

RECOMMENDED: If you have Windows errors then we strongly recommend that you download and run this (Windows) Repair Tool.

He hasn’t committed an error in five games during. They’re going to take their time, make sure he’s healthy, but the good thing is the MRI was negative,” Pedrique said. Reach DJ Eberle at 570-991-6398 or on Twitter @ByDJEberle

Error Initializing Renderware Ok, every time I try to start a game it comes up with the same error for each game. Error starting engine, and then Error initializing renderware, and then. Gemein wrote: "Do not mess with Joffrey, else you could end like Eddard Stark" rc, UNIX Configuration or Initialization File. RC, Visual C++. Apple II CD

Best way to start is to show you those errors in the good ole event log: Error 1001: Fault bucket , type 0. Event Name: CLR20r3. Response: Not available

Users are charged $1.20 each time the operator takes a call, according to Optus’s website. The telco blamed the mistake on a software coding error in its billing system, which was fixed in September. "Optus apologises to all customers who.

Empty/Blank IIS Manager When SharePoint Timer Throws Error – Nov 13, 2008. Empty/blank IIS manager from SharePoint Timer error. In the event viewer under Application you see error codes for 6398, 7076, and 6482.

His response: "I see myself retiring from the NBA to spend time with my wife and kids. Also retirining [sic] as one of the greatest to play the game." Not a bad predicition. Wade points out his spelling error in the caption, and also the fact.

Win 2k Error Lsass.exe De La Soul performs at a Spotify event in New York in 2016. Music streaming service Spotify no longer officially supports Apple’s Safari browser, and Safari users who attempt to access it say they are being redirected to use another browser. Hard Disk Error Message Windows Xp #1 Hard Disk Recovery Software – Recover HDD

Home > 6398 Sharepoint > Error 6398 Timer Error 6398 Timer. Contents. Error 6398 Sharepoint Foundation; Error 6398 Sharepoint 2013;

Apr 23, 2007. Event Type: Error Event Source: Windows SharePoint Services 3. Event Category : Timer Event ID: 6398. Date: 23/04/2007. Time: 3:23:32 PM

Jun 27, 2012  · Hi Busapps, 1. Please make sure your service account and synchronization account have proper permissions to the databases and AD. 2. Please go to timer.

SharePoint Foundation Critical 6398 Timer error. My event log which has a critical Sharepoint foundation error with event task 6398 Timer:

Playing over the par‐72, 6,398‐yard championship course of the Ridgeway Conutry. The tournament committee returned to the long‐time format of match play this year since the number of players did not appreciably increase during the two.

SharePoint Server 2013 SP1, TFS2013, SQL Server 2012 Standard SP2 Running in Hyper-V on a Server 2012 R2 vm I receive this error at a regular intervals such as every.

Jan 27, 2017  · Technically we have Sharepoint 2016 setup. But we don’t have anything in a cloud. All local server with SQL Server. So it acts like Sharepoint 2013. Have 3.

SBS 2011 – SharePoint Foundation Event ID 6398 – MPECS Inc. Blog – Jan 5, 2011. SBS 2011 – SharePoint Foundation Event ID 6398 – Access Denied Every 30 Minutes. Task Category: Timer. To fix the error we need to reset the permissions on that folder as the KB sets the following permissions: image.

109.8 Printer Error My printer said i had a firmware problem and now says 109.11. My printer said i had a firmware problem and now says 109.11 Service printhead error Submitted:. Mar 7, 2016. The future of Roland eco-solvent printers. 109.8. 10.2. 360 x 720. Bi. 4. 165.7. 15.4. High. Speed. 540 x 360. Bi. 3. or motor

Service Unavailable: HTTP Error 503. The service is unavailable error normally occurs whenever the password for application pool identity account is changed or.

User Profile Service Timer Job Failed – Microsoft.SharePoint.2013. – A critical state of this Monitor indicates that one of User Profile timer jobs has thrown an exception. <Value Type="UnsignedInteger">6398</Value>

In my medium farm, one server has timer error 6398 every night at 12am. Scheduled Page Review Timer Service fails nightly. Everything else is great.

Several features of Microsoft Windows SharePoint Services 3.0 rely on scheduled background processes called timer jobs. Administrators can configure.

RECOMMENDED: Click here to fix Windows errors and improve system performance

Ftp Error 00007

Posted by Ariel on September 23, 2017 in KB with Comments closed |

RECOMMENDED: If you have Windows errors then we strongly recommend that you download and run this (Windows) Repair Tool.

FTP server return codes always have three digits, and each digit has a special meaning. Even some "permanent" error conditions can be corrected, so the human user may want to direct his User-process to reinitiate the command sequence.

All Other Mainframe Topics: I am trying to FTP a file to FTP Server, I am getting the following error. EZA1736I put //DD:SYSUT1 FTPTEST.TXT EZA1542I.

No part of this hardcopy may be reproduced in any form without prior permission of Mazda Motor Europe GmbH. The illustrations, technical information, data and.

Error 6398 Timer He hasn’t committed an error in five games during. They’re going to take their time, make sure he’s healthy, but the good thing is the MRI was negative,” Pedrique said. Reach DJ Eberle at 570-991-6398 or on Twitter @ByDJEberle Error Initializing Renderware Ok, every time I try to start a game it comes up with

Aug 02, 2016  · The BD FACSPresto ™ Near-Patient CD4 Counter was developed to expand HIV/AIDS management in resource-limited settings. It.

Error Undeclared First Use In This Function Gcc Problem 4: When trying to use endl to end a printed line, the compiler says end1 is an “undeclared identifier” Answer 4: Make sure you do not mistake the letter l. gcc -g -Wall assign1.c main.c -o test main.c: In function 'byte_sort_test1': main.c: 25: error: 'actual_ouput' undeclared (first use in this function). The C++ Core

.EZA1735I Std Return Code = 27000,EZA1735I Std Return Code = 27000, Error Code = 00007. Check if the FTP parm that you are using has sequence number from.

FTP return codes. By default, The EXTENDED client error code is composed of an FTP client error code and an FTP subcommand code,

IBM MAINFRAME: ftp return code 16000 – All Other Mainframe Topics: Any one has any idea about ftp return code 16000? How this can be solved. FTP job is abending with the.

Laboratory for Experimental Brain Research, University of Lund, Lund, Sweden Correspondence: Maj-Lis Smith, Laboratory for Experimental Brain Research, Wallenberg Neuroscience Center, University Hospital, SE-221 85 Lund,

(Figure 1-1). These same skills of observation and sketching are then used in visualizing designs for new spaces and objects (Figure 1-2). This process of brain, eye, and hand coordination is an intrinsic part of design. Architectural.

How To Fix Ftp Error 00007 Tutorial – zfishinc.com – If you are using perl for the FTP, passive or port mode. We'll email youwhen relevant content isadded and updated. Is a long-standing provision of the We'll email.

Guidelines for Managing Tablespaces. A tablespace is a database storage unit that groups related logical structures together. The database data files are stored in.

. port with P4Python that was not compiled with SSL compatibility you will get the error:. cd. wget ftp://ftp.perforce.com/perforce/r12.2/bin.tools/p4python.tgz tar -xvf. /usr/local/ssl/lib/libssl.so.1.0.0 (0x00007f93465f8000) libcrypto.so.1.0.0.

By default, the FTP client ignores any errors that occur during a session and exits with a return code of zero. You can direct FTP to exit on error with a nonzero.

FTP error code – ABENDS & SQL Codes – getting an Std Return Code = 19331, Error Code = 00009 during file transfer.Does anyone know what does this indicate!

RECOMMENDED: Click here to fix Windows errors and improve system performance

Sprint Http 302 Error

Posted by Ariel on September 23, 2017 in KB with Comments closed |

RECOMMENDED: If you have Windows errors then we strongly recommend that you download and run this (Windows) Repair Tool.

If you’re looking for fully dressed turn-key power, you’ve come to the right place. Our huge selection of performance Chevy crate engines and Ford crate engines from.

Home > mip 65 > sprint http 302 error Sprint Http 302 Error. Messaging My preferences Change email address Change Sprint.com password Change Sprint.com username.

Powerful is a responsive template based on Bootstrap. This fluid layout is ready for mobile devices and provided by templatemo for free download.

Hello, I am using uploadify v2.1.0 with spring, browser Firefox and experiencing HTTP Error 302. At one point, I was able to successfully make the request,

LONDON, UK / ACCESSWIRE / September 22, 2017 / Pro-Trader Daily has just published a free post-earnings coverage on The Toronto-Dominion Bank (NYSE: TD, which can be viewed by registering at http. up from C$302 million in Q3.

Error Undeclared First Use In This Function Gcc Problem 4: When trying to use endl to end a printed line, the compiler says end1 is an “undeclared identifier” Answer 4: Make sure you do not mistake the letter l. gcc -g -Wall assign1.c main.c -o test main.c: In function 'byte_sort_test1': main.c: 25: error: 'actual_ouput' undeclared (first use in this function). The C++ Core
Ftp Error 00007 FTP server return codes always have three digits, and each digit has a special meaning. Even some "permanent" error conditions can be corrected, so the human user may want to direct his User-process to reinitiate the command sequence. All Other Mainframe Topics: I am trying to FTP a file to FTP Server, I am getting

Classic Cars Online SA. We are Classic Car enthusiasts that want to bring all classic car lovers together in finding or selling classic cars. We are here to assist.

Java OCP 8 Programmer II Study Guide | Down Home. – Down Home Country Coding With Scott Selikoff and Jeanne Boyarsky – Java/J2EE Software Development and Technology Discussion Blog

sync_gateway – Connects Couchbase Lite to Couchbase Server

http 302 object moved, related to sessionID stored in cookie? Feb 11, you can make it lot better with error handling and stuff. but i hope you get my point.

List of HTTP status codes. In contrast to how 302 was. This class of status code is intended for situations in which the error seems to have.

Oral Creatine Supplementation and Skeletal Muscle. – Creatine is the object of growing interest in the scientific literature. This is because of the widespread use of creatine by athletes, on the one hand, and to some.

7th annual American Sprint Car Series Jesse Hockett. $20; $35 both days, lunch included. http://www.evangel.edu/faithandarts/ “Good People,” 7:30 p.m.,

Jun 9, 2015. This list of HTTP status codes includes all codes from the HTTP/1.1. The fourth class of codes is used when the client has made an error. agents do not recognize 303, in which case the 302 status code can be used instead. Not a part of the HTTP standard, this status code is deprecated by Spring.

LONDON, UK / ACCESSWIRE / August 15, 2017 /Pro-Trader Daily has just published a free post-earnings coverage on.

With any error message, particularly one as broad as the 500 Internal Server Error, you will first want to check any Apache and PHP error logs for your server. These.

Maximal voluntary contraction force, SR function and glycogen resynthesis during the first 72 h after a high-level competitive soccer game

Sep 1, 2011. (In the background, Spring obtains an OAuth request token from the. Cookie: < snip> HTTP/1.1 302 Moved Temporarily Date: Thu, 01 Sep.

RECOMMENDED: Click here to fix Windows errors and improve system performance

Error Undeclared First Use In This Function Gcc

Posted by Ariel on September 23, 2017 in KB with Comments closed |

RECOMMENDED: If you have Windows errors then we strongly recommend that you download and run this (Windows) Repair Tool.

Problem 4: When trying to use endl to end a printed line, the compiler says end1 is an “undeclared identifier” Answer 4: Make sure you do not mistake the letter l.

gcc -g -Wall assign1.c main.c -o test main.c: In function 'byte_sort_test1': main.c: 25: error: 'actual_ouput' undeclared (first use in this function).

The C++ Core Guidelines are a set of tried-and-true guidelines, rules, and best practices about coding in C++

Ideally the tests should work in standalone packages – built out-of-LLVM-sources – and with GCC/Clang, however the real life is less bright and this forced me to use.

GCC. the first phase of lookup. For example, consider this line of code: A conforming compiler will parse Foo as a variable in the scope of T, meaning this code is an or operation between two comparisons. If you meant to use Foo as.

. error !!!! ********* */ } int x; /* Definition of global var x */ void f2() /* Function f2() that uses global var x */ { x = 4; }. To compile: gcc -c global1.c. Result: global1.c: In function 'f1': global1.c:(line) 5: error: 'x' undeclared (first use in this function).

Mark Joseph Stern Mark Joseph Stern is a writer for Slate. He covers the law and LGBTQ issues. First up: On Saturday. she is notified and has an opportunity to fix the error.) Advertisement Two Democratic groups challenged the Florida.

There is no String Data Structure as such in C. The general term we use as String is actually a \0 terminated character array. So here is what you can do

May 05, 2009  · This works by skipping over the entire header if it was already included. __X_H_INCLUDED__ is #defined the first time x.h is included — and if x.h is included a.

Error 6398 Timer He hasn’t committed an error in five games during. They’re going to take their time, make sure he’s healthy, but the good thing is the MRI was negative,” Pedrique said. Reach DJ Eberle at 570-991-6398 or on Twitter @ByDJEberle Error Initializing Renderware Ok, every time I try to start a game it comes up with

Common gcc error messages. conepainting.c:30: error: 'KInchesPerFoot' undeclared (first use in this.h function prototype has different number of.

C compilation errors: undeclared (first use in this. The first error; i2cset.c: In function 'check_funcs. with gcc there is a set of predefined directories.

Open Source: NTFS-3G – Tuxera – NTFS-3G is a stable, full-featured, read-write NTFS driver for Linux, Android, Mac OS X, FreeBSD, NetBSD, OpenSolaris, QNX, Haiku, and other operating systems.

Note that we use GCC (GNU C Compiler), so other compilers may have slightly. cintro_exercise.c:24: error: 'a_sum' undeclared (first use in this function).

variable ' undeclared (first use in this function): In C and C++ variables must be declared before they can be used. This error message indicates that the compiler.

RECOMMENDED: Click here to fix Windows errors and improve system performance

Hard Disk Error Message Windows Xp

Posted by Ariel on September 23, 2017 in KB with Comments closed |

RECOMMENDED: If you have Windows errors then we strongly recommend that you download and run this (Windows) Repair Tool.

#1 Hard Disk Recovery Software – Recover HDD Data Up to 16TB – 3 Steps Recover Deleted/Formatted/Lost Files.Try & Free Scan Your Hard Disk Now!

When you encounter a problem or error message during migration. Cause #2: If the source computer was running Windows® XP and the desktop background was stored in the Drive:WINDOWSWebWallpaper folder—the default.

Found the original Windows XP installation disk, turned the PC on, but all I get is the same message "Disk read error occurred press Ctl+Alt =Del to. stander2, The hard drive might have gone bad, or maybe the flat cable.

Get the fix for the error A disk read error occurred on Windows XP, Windows Vista, Windows 7 and Windows 8. About "A disk read error occurred" Description

Aug 26, 2013. Error loading operating system: Fix for Windows XP, Vista, 7. There are no other known alternative messages for this boot error, except the “Error. The most common cause of this error is a hard drive that is too large to be.

When you reach the Welcome Screen of Windows XP Setup and choose to install Windows you are presented with the error “Setup did not find any hard disk drives.

What to do when Windows detected a hard disk problem? This article tells causes and provides several solutions to fix ‘Windows detected a hard drive problem’.

Error While Loading Shared Libraries Libdb-4.7.so Hello everyone, Recently I came across this error while booting up our RHEL 5 server: Starting send mail:/ user/ sbin/sendmail:error while loading Error Code #50034 Ebay If you are unable to pay sellers due to an error code 70002 go to the shopping cart on the upper right hand corner of your account summary page

Error Checking is the Windows version of CHKDSK, a hard drive check/repair tool included with Windows 10, 8, 7, Vista, & XP. Note: If you get a Windows can't check the disk while it's in use message, click the Schedule disk check button,

Feb 3, 2015. Get the fix for the error A disk read error occurred on Windows XP, The error messages, alerts, warnings, and symptoms below are tied to this error. If the error is caused by damaged hard disk cables, try any of the.

Trying to install Windows XP within VMWare ESX and getting the following error message? "Setup did not find any hard disk drives installed in your com

Fix All Disk Errors & Free up your Hard Drive in Minutes – Free Download.

Q The 40-gigabyte hard disk on my older Dell Windows XP computer has been giving me this error message when I try to start it: "primary hard disk 0 failure — no boot device available — no bootable device." But if I let the PC sit for 10.

Hard disk drive – The only message. hard drives (which were connected to my PC the time when the virus hit) have ‘disappeared’. I’m on Win 7. However, I can see my files (greyed out) and I am able to retrieved them in another older PC (windows XP).

It borrows some of your host computers resources, like hard disk space and RAM and uses those to run the virtual computer. With a virtual machine, you can have a full-fledged Windows XP computer running. and you’ll see a.

Error Checking is the Windows version of CHKDSK, a hard drive check/repair tool included with Windows 10, 8, 7, Vista, & XP. Here’s how to use it.

Get DriverUpdate For XP, Vista, Windows 7 & 8 – Fast & Free!

Windows cannot access this drive, do you wish to format it, is the message that you will receive when you try to open your hard disk drive or a partition on your HDD.

Oct 24, 2007. How to Run a chkdsk to Repair Your Damaged Hard Drive. Boot your computer from your Windows XP Cd or from your 6-disk. If after the test completes, the message “One or more errors detected on the volume” appears, then. Yourself From the Windows/System32/Config error Message How to Boot.

Otherwise, the ASR recovery procedure will terminate and display an error message once it realizes the new hard disk is smaller. Getting started with recovery To recover your Windows XP Professional system with an ASR backup set.

RECOMMENDED: Click here to fix Windows errors and improve system performance

109.8 Printer Error

Posted by Ariel on September 23, 2017 in KB with Comments closed |

RECOMMENDED: If you have Windows errors then we strongly recommend that you download and run this (Windows) Repair Tool.

My printer said i had a firmware problem and now says 109.11. My printer said i had a firmware problem and now says 109.11 Service printhead error Submitted:.

Mar 7, 2016. The future of Roland eco-solvent printers. 109.8. 10.2. 360 x 720. Bi. 4. 165.7. 15.4. High. Speed. 540 x 360. Bi. 3. or motor error occurs.

When subjects perform a learned motor task with increased visual gain, error and variability are reduced. Neuroimaging.

1 2016 figure adjusted for one-off items resulting from transaction activities and related reorganization expenses 2 2016 figure additionally adjusted for financing expenses and tax expenses in connection with the acquisitions of the Diatron.

I have a Lexmark C543dn that is displaying an error 109.08, service printhead error. This printer is only a few months old and might have a total of 500 pages printed.

A Printhead Error Is Appearing on a Lexmark E250d(n), E350d, E352dn, or E450dn Printer. Document ID:SO3848 Usergroup :External. Languages. Properties.

106.xx Troubleshooting steps; 107.xx troubleshooting steps; 108.xx troubleshooting steps; 109.xx troubleshooting steps

Win 2k Error Lsass.exe De La Soul performs at a Spotify event in New York in 2016. Music streaming service Spotify no longer officially supports Apple’s Safari browser, and Safari users who attempt to access it say they are being redirected to use another browser. Hard Disk Error Message Windows Xp #1 Hard Disk Recovery Software – Recover HDD
Hard Disk Error Message Windows Xp #1 Hard Disk Recovery Software – Recover HDD Data Up to 16TB – 3 Steps Recover Deleted/Formatted/Lost Files.Try & Free Scan Your Hard Disk Now! When you encounter a problem or error message during migration. Cause #2: If the source computer was running Windows® XP and the desktop background was stored in the Drive:WINDOWSWebWallpaper folder—the

4.5.1 – Parallel printer. 7.3.8 – Parallel printer. 9 – PRINTINg FoRMATS FoR RESuLTS. 57. 12 Percentage of error between the 2 torque and/or angle. or. In addition, the following is displayed on screen no 001: 48.9. 109.8. Nm.

Trying to add HPC4585 printer and am getting print spooler error (0x000006be). I used to have printer installed but on a network and am now trying to install usb plug in.

74.3° 101.8° 105.1° 167° 15-inch MacBook Pro Core 2 Duo/2.16GHz 73.5° 109.8° 110.3° 174° 15-inch MacBook Pro Core 2 Duo/2.33GHz 73.5° 116.1° 116.9° 174° Here’s another indicator about the not-as-hot performance of the new.

108 mbps wireless printer server 109.8 printer error 10foot parallel printer cable 10-foot usb-to-parallel printer adapter cable 10ft bidir parallel printer

Error Codes for HP Printers – HP & Lexmark Printer. – HP Laser printer error code information with symptoms, causes, parts and repair links

The latest series of ECOSYS printers and multi-function devices offer you excellent print quality and enable flexible work environments via easy Wi-Fi.

1. Mr Speaker Sir, in terms of Chapter 17, Section 305(1-2) of the New Constitution of Zimbabwe, read together with Section 28(1) (a) of the Public Finance Management Act Chapter 22:19, I move that leave be granted to present a.

The attachment, called Google Lens, can boost the camera view from 54.8 degrees horizontally and 42.5 degrees vertically to 109.8 degrees and 57.8 degrees, respectively, according to the researchers. [ Further reading: The best surge.

Back to Microwave Oven Repair FAQ Table of Contents. Introduction Radar Range anyone? Remember when you actually had to use the real oven to defrost a TV dinner?

Error While Loading Shared Libraries Libdb-4.7.so Hello everyone, Recently I came across this error while booting up our RHEL 5 server: Starting send mail:/ user/ sbin/sendmail:error while loading Error Code #50034 Ebay If you are unable to pay sellers due to an error code 70002 go to the shopping cart on the upper right hand corner of your account summary page

RECOMMENDED: Click here to fix Windows errors and improve system performance

Error Initializing Renderware

Posted by Ariel on September 23, 2017 in KB with Comments closed |

RECOMMENDED: If you have Windows errors then we strongly recommend that you download and run this (Windows) Repair Tool.

Ok, every time I try to start a game it comes up with the same error for each game. Error starting engine, and then Error initializing renderware, and then.

Gemein wrote: "Do not mess with Joffrey, else you could end like Eddard Stark"

rc, UNIX Configuration or Initialization File. RC, Visual C++. Apple II CD Rom). RIP, Lotus Notes Error File (IBM). RWX, RenderWare Script. RWZ, Outlook.

bir dosya alirsiniz ve bilgisayariniz ne oldugunu anlamaz "bu ne yaa, ne calistiriyor bunu" derken elinizin altinda bu uzantilarin listesinin olmasini hayal edersiniz.

109.8 Printer Error My printer said i had a firmware problem and now says 109.11. My printer said i had a firmware problem and now says 109.11 Service printhead error Submitted:. Mar 7, 2016. The future of Roland eco-solvent printers. 109.8. 10.2. 360 x 720. Bi. 4. 165.7. 15.4. High. Speed. 540 x 360. Bi. 3. or motor

Usage Statistics for communitygaze.com – June 2017. – Usage Statistics for communitygaze.com Summary Period: June 2017 – Search String Generated 01-Jul-2017 02:11 PDT

.err error messages for command line compilers.esh Extended Shell batch..inf install script.ini initialization file.rwx script (RenderWare) S.s ASSEMBLY.

Error Initializing Renderware? Any Advice??? < > Showing 1-2 of 2 comments gazoo 420. Jan 5, 2016 @ 8:44pm i get the same thing mine says AVISteamGetFrameOpen.

Hard Disk Error Message Windows Xp #1 Hard Disk Recovery Software – Recover HDD Data Up to 16TB – 3 Steps Recover Deleted/Formatted/Lost Files.Try & Free Scan Your Hard Disk Now! When you encounter a problem or error message during migration. Cause #2: If the source computer was running Windows® XP and the desktop background was stored in the Drive:WINDOWSWebWallpaper folder—the

.dff 3D Image RenderWare Model File.dfm Developer Delphi Form.dfm Data. Final Draft Document.fdr Misc Windows Error Report File.fds Text Final Draft. Bank Setup File.ini Settings Windows Initialization File.ini Settings Symbian.

. and video, Renderware TeXture Dictionary video, Bethesda Software VID video via lavc. to the H.264 decoder to make it a lot faster and more error- resilient. output driver; fall back on next video output driver if vo_3dfx failed to initialize.

Win 2k Error Lsass.exe De La Soul performs at a Spotify event in New York in 2016. Music streaming service Spotify no longer officially supports Apple’s Safari browser, and Safari users who attempt to access it say they are being redirected to use another browser. Hard Disk Error Message Windows Xp #1 Hard Disk Recovery Software – Recover HDD

RECOMMENDED: Click here to fix Windows errors and improve system performance

Win 2k Error Lsass.exe

Posted by Ariel on September 23, 2017 in KB with Comments closed |

RECOMMENDED: If you have Windows errors then we strongly recommend that you download and run this (Windows) Repair Tool.

De La Soul performs at a Spotify event in New York in 2016. Music streaming service Spotify no longer officially supports Apple’s Safari browser, and Safari users who attempt to access it say they are being redirected to use another browser.

Hard Disk Error Message Windows Xp #1 Hard Disk Recovery Software – Recover HDD Data Up to 16TB – 3 Steps Recover Deleted/Formatted/Lost Files.Try & Free Scan Your Hard Disk Now! When you encounter a problem or error message during migration. Cause #2: If the source computer was running Windows® XP and the desktop background was stored in the Drive:WINDOWSWebWallpaper folder—the

Jose Bautista drives in a run on a popup that drops in right, then Josh Donaldson adds to the Blue Jays’ lead on the error by Brian Dozier

Category: Hack Victim Computer. #mimikatz is another great tool which extracts the plain text passwords of users from lsass.exe. First Step press win+ RGo to.

The svchost.exe process is part of Host Process for Services of Microsoft. Here are further details of svchost.exe, and whether it might be a virus or spyware.

Nov 7, 2004. In the end I copied lsass.exe and services.exe from a 'clean' pc. I have this same error on an IBM Thinkpad running Windows 2000.

Then you can use the old quicklaunch-style win+[num]. Here you can find descriptions for more than 20 thousand Windows processes like explorer.exe, lsass.exe,

Active directory error – Petri IT Knowledgebase Forums – Nov 12, 2012. Please help on my windows 2003 server i am getting below message. LSASS. EXE – System Error, security accounts manager initialization failed because. MCT, MCSE (2000:Security & 2003), MCSA:Security & Messaging,

This article is based primarily on a local default setup of NT5.0 Professional or 2K (Windows 2000), however there maybe additional verified references to XP.

How does in-game resolution affect CPU usage? How does in-game frame rate affect CPU usage? Opinions and second-hand knowledge always fall short of.

NBA – While this is no doubt good for the bottom line at 2K, I can’t help but wonder if this is bad for the health of the game in the long run. Pay to win is generally accepted.

Browser Redirect Hijack. \WINDOWS\system32\lsass.exe C:. (Win+ F) to find all instances of it. Espoo, Sep 9, 2005 #3.

How to fix the error message, "Lsass.exe-System error: The endpoint format is. 2003, Datacenter Edition (32-bit x86), Microsoft Windows 2000 Server, etc.

Error While Loading Shared Libraries Libdb-4.7.so Hello everyone, Recently I came across this error while booting up our RHEL 5 server: Starting send mail:/ user/ sbin/sendmail:error while loading Error Code #50034 Ebay If you are unable to pay sellers due to an error code 70002 go to the shopping cart on the upper right hand corner of your account summary page

LSASS.EXE – System Error, security accounts manager initialization failed because. Windows 2000/2003 Active Directory is out of Sync After Primary Domain.

Shutdown hangs. Discussion in '. Windows knowledgebase does not seem to think Win 2k has shutdown problems Thanx Matt Matt. \WINNT\system32\lsass.exe C:.

TOKYO (AP) – Zarina Diyas won her first WTA title on Sunday, beating home favorite Miyu Kato 6-2, 7-5 to take the Japan Women’s Open title. In a final made up of two qualifiers, the 23-year-old Diyas broke Kato in the first game before a.

Nintendo sometimes receives criticism from fans for a lack of games from third-party publishers such as 2K, so having a big, successful franchise like WWE come to its newest system is a big win for the Japanese. that it made an error.

Hi there every one, here every one is sharing these kinds of familiarity, thus it's good to read this web site, and I used to pay a visit this

Explorer.EXE file information Explorer.EXE process in Windows Task Manager. The process known as Windows Explorer or Win or TJprojMain or.

Jul 11, 2009. Bad Image Error (Win XP) (Resolved). By aznthundrhed, July 11, 2009 in. C: WINDOWSsystem32lsass.exe. Web 2K/XP–>RunDll32.

The Jays opened the scoring n the 2nd inning, as Teoscar Hernandez lead off with.

We are currently experiencing a problem with one of our Windows 2003 servers. The server is also running MSSQL 2000, ColdFusion MX 6.1 and Plesk 7.5. Reporting queued error: faulting application lsass.exe, version.

RECOMMENDED: Click here to fix Windows errors and improve system performance

Company Of Heroes Error Code 10264

Posted by Ariel on September 23, 2017 in KB with Comments closed |

RECOMMENDED: If you have Windows errors then we strongly recommend that you download and run this (Windows) Repair Tool.

Error While Trying To Retrieve Text For Error Ora-12154 Goldengate Support / Connector: Error while trying to retrieve text for error ORA-12154. Was this article helpful?. "Error while trying to retrieve text for error ORA-12154" Object Error When Opening Hotmail To show that you have Node installed open. error occurred. #server.js. // GET HTTP request is called on /todos path app.get(‘/todos’, (req, res) => {

Retrouvez toutes les discothèque Marseille et se retrouver dans les plus grandes soirées en discothèque à Marseille.

Breitbart TV is the home of the hottest video on politics, world events, culture, and media.

Nvidia released the new Nvidia Game Ready driver for Heroes of the Storm 2.0 and Warhammer 40,000. the application crashes when enabling the in-game Ansel UI. [200283194] Error code 43 appears in the Device Manager after.

How To Fix Error Code 10244 Company Of Heroes Errors. – How to Fix Error Code 10244 Company Of Heroes Errors Windows operating system misconfiguration is the main cause of Error Code 10244 Company Of Heroes error

Home > Error Code > Company Of Heroes Error Code 10264 Company Of Heroes Error Code 10264. Contents. Company Of Heroes 2 Error Code 3;. Company Of Heroes 2 Error.

While each of us knows intuitively that we have cognitive assistance in our pockets I was especially interested in the comments that accuracy and speed is often a.

At 9am Archer had been told that a large number of unexploded bombs were hampering attempts by firefighters to control a major blaze at the Anglo-Iranian Oil Company’s refinery. Service Medal The Cockleshell Heroes raid was one of the.

Company Of Heroes Error Code 10264. Burak-09k 2092 Mesaj 5 Şubat Company Of Heroes 2 Error Code 3 100035-helpwithscriptplease 100037-Logic error 100038-Drama.

Hey Everyone, I couldn't find this in the forums anywhere, but is there an error code list?

RECOMMENDED: Click here to fix Windows errors and improve system performance

Error While Loading Shared Libraries Libdb-4.7.so

Posted by Ariel on September 23, 2017 in KB with Comments closed |

RECOMMENDED: If you have Windows errors then we strongly recommend that you download and run this (Windows) Repair Tool.

Hello everyone, Recently I came across this error while booting up our RHEL 5 server: Starting send mail:/ user/ sbin/sendmail:error while loading

Error Code #50034 Ebay If you are unable to pay sellers due to an error code 70002 go to the shopping cart on the upper right hand corner of your account summary page and. eBay Apply. Le Live Marseille : aller dans les plus grandes soirées. – Retrouvez toutes les discothèque Marseille et se retrouver dans les plus grandes

Just downloaded binary version of Webalizer but for some reason it is giving me an error about libdb-4.4.so. error while loading shared libraries: libdb-4.4.so:.

Linux error while loading shared libraries: cannot open shared. – Jan 26, 2009. Generally, the numbers after the.so are version numbers, and you'll. the most recent shared libraries found in the directories specified on the.

rpm: error while loading shared libraries: libdb-4.7.so: cannot open shared object file: No such file or directory this all started when i, perhaps.

2013年12月7日. slapd: error while loading shared libraries: libdb-4.7.so: cannot open shared object file: No such file or directory. 将服务器重新启动后发现ldap.

(Not sure) When I key webalizer from ssh it's show me. webalizer: error while loading shared libraries: libdb-4.7.so: cannot open shared object.

Webalizer on my VPS not work for all domain.It's show me. I was try as on. http://help.directadmin.com/item.php?id=63 But no luck.

Hello everyone, Recently I came across this error while booting up our RHEL 5 server: Starting send mail:/ user/ sbin/sendmail:error while.

Seams i have a trouble with running daemon under Ubuntu i am always got error message error while loading shared libraries: libdb-4.7.so I am tring to instal 1.1.0.

The runtime library cannot find the.so file. There are [at least] two ways to specify the dynamic linker search path. The environment variable LD_LIBRARY_PATH (only.

12.04 – squidGuard: error while loading shared libraries: libdb-6.0.so. – Nov 13, 2013. Heloo, may be, you can test, this command. [email protected]:~ # apt-file search libdb-6.0.so libdb6.0: /usr/lib/x86_64-linux-gnu/libdb-6.0.so.

RECOMMENDED: Click here to fix Windows errors and improve system performance

Copyright © 2017 wrecksrobot.com All rights reserved.
This site is using the Multi Child-Theme, v2.2, on top of
the Parent-Theme Desk Mess Mirrored, v2.5, from BuyNowShop.com